Information card for entry 7005327
Formula | C42 H22 F18 N3 Nd O6 |
Calculated formula | C42 H22 F18 N3 Nd O6 |
Title of publication | Anthracene as a sensitiser for near-infrared luminescence in complexes of Nd(III), Er(III) and Yb(III): an unexpected sensitisation mechanism based on electron transfer. |
Authors of publication | Lazarides, Theodore; Alamiry, Mohammed A. H.; Adams, Harry; Pope, Simon J. A.; Faulkner, Stephen; Weinstein, Julia A.; Ward, Michael D. |
Journal of publication | Dalton transactions (Cambridge, England : 2003) |
Year of publication | 2007 |
Journal issue | 15 |
Pages of publication | 1484 - 1491 |
a | 12.4875 ± 0.0015 Å |
b | 12.8921 ± 0.0015 Å |
c | 13.5629 ± 0.0017 Å |
α | 79.429 ± 0.002° |
β | 77.367 ± 0.003° |
γ | 85.85 ± 0.002° |
Cell volume | 2093.3 ± 0.4 Å3 |
Cell temperature | 150 ± 2 K |
Ambient diffraction temperature | 150 ± 2 K |
Number of distinct elements | 6 |
Space group number | 2 |
Hermann-Mauguin space group symbol | P -1 |
Hall space group symbol | -P 1 |
Residual factor for all reflections | 0.0633 |
Residual factor for significantly intense reflections | 0.0472 |
Weighted residual factors for significantly intense reflections | 0.1005 |
Weighted residual factors for all reflections included in the refinement | 0.1067 |
Goodness-of-fit parameter for all reflections included in the refinement | 0.957 |
Diffraction radiation wavelength | 0.71073 Å |
Diffraction radiation type | MoKα |