Information card for entry 7005328
Formula | C42 H22 F18 Gd N3 O6 |
Calculated formula | C42 H22 F18 Gd N3 O6 |
Title of publication | Anthracene as a sensitiser for near-infrared luminescence in complexes of Nd(III), Er(III) and Yb(III): an unexpected sensitisation mechanism based on electron transfer. |
Authors of publication | Lazarides, Theodore; Alamiry, Mohammed A. H.; Adams, Harry; Pope, Simon J. A.; Faulkner, Stephen; Weinstein, Julia A.; Ward, Michael D. |
Journal of publication | Dalton transactions (Cambridge, England : 2003) |
Year of publication | 2007 |
Journal issue | 15 |
Pages of publication | 1484 - 1491 |
a | 12.6188 ± 0.0011 Å |
b | 12.9157 ± 0.0011 Å |
c | 13.4422 ± 0.0012 Å |
α | 79.884 ± 0.001° |
β | 77.75 ± 0.001° |
γ | 88.007 ± 0.001° |
Cell volume | 2107.6 ± 0.3 Å3 |
Cell temperature | 150 ± 2 K |
Ambient diffraction temperature | 150 ± 2 K |
Number of distinct elements | 6 |
Space group number | 2 |
Hermann-Mauguin space group symbol | P -1 |
Hall space group symbol | -P 1 |
Residual factor for all reflections | 0.0593 |
Residual factor for significantly intense reflections | 0.0527 |
Weighted residual factors for significantly intense reflections | 0.1426 |
Weighted residual factors for all reflections included in the refinement | 0.1493 |
Goodness-of-fit parameter for all reflections included in the refinement | 1.065 |
Diffraction radiation wavelength | 0.71073 Å |
Diffraction radiation type | MoKα |