Information card for entry 7008999
Formula | C24 H42 Mo N4 O2 Si2 |
Calculated formula | C24 H42 Mo N4 O2 Si2 |
SMILES | [Mo]12(=O)(=O)(N([Si](C)(C)C(C)(C)C)c3[n]1c(ccc3)C)N([Si](C)(C)C(C)(C)C)c1[n]2c(ccc1)C |
Title of publication | Synthesis and structures of dioxo-Mo(VI) and -W(VI) amides |
Authors of publication | Kay Lee, Hung; Wong, Yee-Lok; Zhou, Zhong-Yuan; Zhang, Ze-Ying; Ng, Dennis K. P.; Mak, Thomas C. W. |
Journal of publication | Journal of the Chemical Society, Dalton Transactions |
Year of publication | 2000 |
Journal issue | 4 |
Pages of publication | 539 |
a | 16.342 ± 0.003 Å |
b | 16.007 ± 0.003 Å |
c | 22.218 ± 0.004 Å |
α | 90° |
β | 90° |
γ | 90° |
Cell volume | 5811.9 ± 1.8 Å3 |
Cell temperature | 294 ± 2 K |
Ambient diffraction temperature | 294 ± 2 K |
Number of distinct elements | 6 |
Space group number | 61 |
Hermann-Mauguin space group symbol | P b c a |
Hall space group symbol | -P 2ac 2ab |
Residual factor for all reflections | 0.0916 |
Residual factor for significantly intense reflections | 0.0744 |
Weighted residual factors for significantly intense reflections | 0.1887 |
Weighted residual factors for all reflections included in the refinement | 0.2051 |
Goodness-of-fit parameter for all reflections included in the refinement | 1.095 |
Diffraction radiation wavelength | 0.71073 Å |
Diffraction radiation type | MoKα |