Information card for entry 7009096
Formula | C10.5 H25.5 As0.5 Li0.5 N1.5 P1.5 |
Calculated formula | C10.5 H25.5 As0.5 Li0.5 N1.5 P1.5 |
Title of publication | A synthetic and structural study of the formation of cyclic [(RP)nE]− anions and Zintl compounds using E(NMe2)3 (E = As, Sb) |
Authors of publication | Bashall, Alan; Beswick, Michael A.; Choi, Nick; Hopkins, Alexander D.; Kidd, Sara J.; Lawson, Yvonne G.; Mosquera, Marta E. G.; McPartlin, Mary; Raithby, Paul R.; Wheatley, Andrew A. E. H.; Wood, Jody A.; Wright, Dominic S. |
Journal of publication | Journal of the Chemical Society, Dalton Transactions |
Year of publication | 2000 |
Journal issue | 4 |
Pages of publication | 479 |
a | 9.218 ± 0.005 Å |
b | 11.182 ± 0.006 Å |
c | 15.967 ± 0.008 Å |
α | 108.44 ± 0.02° |
β | 90.46 ± 0.02° |
γ | 108.01 ± 0.02° |
Cell volume | 1474.6 ± 1.4 Å3 |
Cell temperature | 180 ± 2 K |
Ambient diffraction temperature | 180 ± 2 K |
Number of distinct elements | 6 |
Space group number | 2 |
Hermann-Mauguin space group symbol | P -1 |
Hall space group symbol | -P 1 |
Residual factor for all reflections | 0.0629 |
Residual factor for significantly intense reflections | 0.0445 |
Weighted residual factors for significantly intense reflections | 0.0986 |
Weighted residual factors for all reflections included in the refinement | 0.1104 |
Goodness-of-fit parameter for all reflections included in the refinement | 1.095 |
Diffraction radiation wavelength | 0.71073 Å |
Diffraction radiation type | MoKα |