Information card for entry 7009798
Formula | C20 H31 As Cl O3 P3 W |
Calculated formula | C20 H31 As Cl O3 P3 W |
Title of publication | Addition of the [(tBuP)3As]− anion to the cyclopentadienyl ring of [(C5H5)M(CO)3Cl] (M = Mo, W) |
Authors of publication | Bashall, Alan; Hopkins, Alexander D.; Mays, Martin J.; McPartlin, Mary; Wood, Jody A.; Woods, Anthony D.; Wright, Dominic S. |
Journal of publication | Journal of the Chemical Society, Dalton Transactions |
Year of publication | 2000 |
Journal issue | 12 |
Pages of publication | 1825 |
a | 16.412 ± 0.003 Å |
b | 16.44 ± 0.002 Å |
c | 10.1301 ± 0.0016 Å |
α | 90° |
β | 91.351 ± 0.013° |
γ | 90° |
Cell volume | 2732.5 ± 0.7 Å3 |
Cell temperature | 293 ± 2 K |
Ambient diffraction temperature | 293 ± 2 K |
Number of distinct elements | 7 |
Space group number | 14 |
Hermann-Mauguin space group symbol | P 1 21/c 1 |
Hall space group symbol | -P 2ybc |
Residual factor for all reflections | 0.0817 |
Residual factor for significantly intense reflections | 0.0687 |
Weighted residual factors for significantly intense reflections | 0.1747 |
Weighted residual factors for all reflections included in the refinement | 0.1839 |
Goodness-of-fit parameter for all reflections included in the refinement | 1.004 |
Diffraction radiation wavelength | 0.71073 Å |
Diffraction radiation type | MoKα |