Information card for entry 7009923
Formula | C78 H100 N10 O36 Sr |
Calculated formula | C78 H100 N10 O36 Sr |
Title of publication | Strontium complexes of calixarene amides in the solid state: structural dependence on the ligand size and on the counter ions |
Authors of publication | Casnati, Alessandro; Baldini, Laura; Pelizzi, Nicola; Rissanen, Kari; Ugozzoli, Franco; Ungaro, Rocco |
Journal of publication | Journal of the Chemical Society, Dalton Transactions |
Year of publication | 2000 |
Journal issue | 19 |
Pages of publication | 3411 |
a | 16.0449 ± 0.0018 Å |
b | 16.769 ± 0.003 Å |
c | 18.527 ± 0.002 Å |
α | 101.115 ± 0.012° |
β | 111.009 ± 0.01° |
γ | 104.356 ± 0.013° |
Cell volume | 4283.9 ± 1.2 Å3 |
Cell temperature | 293 ± 2 K |
Ambient diffraction temperature | 293 ± 2 K |
Number of distinct elements | 5 |
Space group number | 2 |
Hermann-Mauguin space group symbol | P -1 |
Hall space group symbol | -P 1 |
Residual factor for all reflections | 0.1175 |
Residual factor for significantly intense reflections | 0.0526 |
Weighted residual factors for significantly intense reflections | 0.0958 |
Weighted residual factors for all reflections included in the refinement | 0.1088 |
Goodness-of-fit parameter for all reflections included in the refinement | 0.938 |
Diffraction radiation wavelength | 0.71073 Å |
Diffraction radiation type | MoKα |