Information card for entry 7010111
Formula | C30 H32 Cl2 N6 Ni O18 |
Calculated formula | C30 H32 Cl2 N6 Ni O18 |
Title of publication | Novel three-dimensional networks cross-linked by two sets of hydrogen bonded frameworks based on 1-D {[M(H2O)4(4,4'-dpdo)][ClO4]2·2(4,4'-dpdo)}n (4,4'-dpdo = 4,4'-bipyridine dioxide; M = Co, Ni, Cu or Zn) |
Authors of publication | Ma, Bao-Qing; Gao, Song; Sun, Hao-Ling; Xu, Guang-Xian |
Journal of publication | Journal of the Chemical Society, Dalton Transactions |
Year of publication | 2001 |
Journal issue | 2 |
Pages of publication | 130 |
a | 5.4646 ± 0.0002 Å |
b | 11.8165 ± 0.0007 Å |
c | 15.0889 ± 0.0009 Å |
α | 108.759 ± 0.002° |
β | 95.4 ± 0.003° |
γ | 100.163 ± 0.003° |
Cell volume | 896.12 ± 0.08 Å3 |
Cell temperature | 293 ± 2 K |
Ambient diffraction temperature | 293 ± 2 K |
Number of distinct elements | 6 |
Space group number | 2 |
Hermann-Mauguin space group symbol | P -1 |
Hall space group symbol | -P 1 |
Residual factor for all reflections | 0.0991 |
Residual factor for significantly intense reflections | 0.0859 |
Weighted residual factors for significantly intense reflections | 0.2063 |
Weighted residual factors for all reflections included in the refinement | 0.212 |
Goodness-of-fit parameter for all reflections included in the refinement | 1.137 |
Diffraction radiation wavelength | 0.71073 Å |
Diffraction radiation type | MoKα |