Information card for entry 7011456
Formula | C102 H126 N16 O13 Sr2 |
Calculated formula | C102 H124 N16 O13 Sr2 |
Title of publication | A new family of ionic dinuclear strontium (imH2)2[Sr2(Q)6] compounds (imH = imidazole; QH = 1-phenyl-3-methyl-4-acylpyrazol-5-one) |
Authors of publication | Marchetti, Fabio; Pettinari, Claudio; Pettinari, Riccardo; Cingolani, Augusto; Drozdov, Andrei; Troyanov, Sergei |
Journal of publication | Journal of the Chemical Society, Dalton Transactions |
Year of publication | 2002 |
Journal issue | 13 |
Pages of publication | 2616 |
a | 14.593 ± 0.003 Å |
b | 14.646 ± 0.003 Å |
c | 15.159 ± 0.003 Å |
α | 106.15 ± 0.03° |
β | 102.99 ± 0.03° |
γ | 114.62 ± 0.03° |
Cell volume | 2605 ± 1.7 Å3 |
Cell temperature | 293 ± 2 K |
Ambient diffraction temperature | 293 ± 2 K |
Number of distinct elements | 5 |
Space group number | 2 |
Hermann-Mauguin space group symbol | P -1 |
Hall space group symbol | -P 1 |
Residual factor for all reflections | 0.2013 |
Residual factor for significantly intense reflections | 0.0816 |
Weighted residual factors for all reflections | 0.2803 |
Weighted residual factors for significantly intense reflections | 0.2048 |
Goodness-of-fit parameter for all reflections | 0.967 |
Goodness-of-fit parameter for significantly intense reflections | 1.187 |
Diffraction radiation wavelength | 0.71073 Å |
Diffraction radiation type | MoKα |