Information card for entry 7012286
Formula | C65 H63 Mo N P4 Si |
Calculated formula | C65 H63 Mo N P4 Si |
SMILES | [MoH]1234([P](c5c([Si]4(c4ccccc4)c4c([P]3(CC[P]2(c2ccccc2)c2ccccc2)c2ccccc2)cccc4)cccc5)(c2ccccc2)CC[P]1(c1ccccc1)c1ccccc1)C#[N]C1CCCCC1 |
Title of publication | Reactions of quadruply chelated silyl- and germyl-molybdenum hydrido complexes with isocyanides: observation of the trans-influence on the silyl ligand |
Authors of publication | Minato, Makoto; Nishiuchi, Jun-ya; Kakeya, Masaki; Matsumoto, Takaomi; Yamaguchi, Yoshitaka; Ito, Takashi |
Journal of publication | Dalton Transactions |
Year of publication | 2003 |
Journal issue | 3 |
Pages of publication | 483 |
a | 12.473 ± 0.003 Å |
b | 20.304 ± 0.005 Å |
c | 12.078 ± 0.003 Å |
α | 98.56 ± 0.02° |
β | 112.41 ± 0.02° |
γ | 78.8 ± 0.02° |
Cell volume | 2764.5 ± 1.2 Å3 |
Cell temperature | 296.2 K |
Number of distinct elements | 6 |
Space group number | 2 |
Hermann-Mauguin space group symbol | P -1 |
Hall space group symbol | -P 1 |
Residual factor for significantly intense reflections | 0.0562 |
Weighted residual factors for all reflections included in the refinement | 0.1563 |
Goodness-of-fit parameter for all reflections included in the refinement | 1.495 |
Diffraction radiation wavelength | 0.7107 Å |
Diffraction radiation type | MoKα |