Information card for entry 7012326
Formula |
C11 H16 Cl2 O2 Te |
Calculated formula |
C11 H16 Cl2 O2 Te |
SMILES |
[Te](Cl)(Cl)(c1c(OC)cccc1OC)C(C)C |
Title of publication |
Dependence of the rotational barrier of the Ar-group in RArTeX2 on the R-group [Ar = 2,6-(MeO)2C6H3; R = Me, Et, i-Pr; X = Cl, Br, I] |
Authors of publication |
Asahara, Masahiro; Taomoto, Shoichiro; Tanaka, Masahito; Erabi, Tatsuo; Wada, Masanori |
Journal of publication |
Dalton Transactions |
Year of publication |
2003 |
Journal issue |
5 |
Pages of publication |
973 |
a |
7.0124 ± 0.0004 Å |
b |
15.1295 ± 0.0005 Å |
c |
26.187 ± 0.001 Å |
α |
90° |
β |
90° |
γ |
90° |
Cell volume |
2778.3 ± 0.2 Å3 |
Cell temperature |
173.1 K |
Number of distinct elements |
5 |
Space group number |
61 |
Hermann-Mauguin space group symbol |
P b c a |
Hall space group symbol |
-P 2ac 2ab |
Residual factor for significantly intense reflections |
0.024 |
Weighted residual factors for all reflections included in the refinement |
0.108 |
Goodness-of-fit parameter for all reflections included in the refinement |
1.024 |
Diffraction radiation wavelength |
0.7107 Å |
Diffraction radiation type |
MoKα |
Yes |
No |
No |