Information card for entry 7012491
Formula | C27 H33 N3 Si2 Sn |
Calculated formula | C27 H33 N3 Si2 Sn |
SMILES | [Sn]12[n]3c(cccc3C=C(N1[Si](C)(C)C)c1ccccc1)C=C(N2[Si](C)(C)C)c1ccccc1 |
Title of publication | Synthesis and structural characterisation of low-valent Group 14 metal complexes containing tridentate 2,6-pyridyl-bridged bis(1-azaallyl) ligands |
Authors of publication | Leung, Wing-Por; Hou, Henry L.; Cheng, Hui; Yang, Qing-Chuan; Li, Hung-Wing; Mak, Thomas C. W. |
Journal of publication | Dalton Transactions |
Year of publication | 2003 |
Journal issue | 8 |
Pages of publication | 1505 |
a | 8.6497 ± 0.0017 Å |
b | 11.619 ± 0.002 Å |
c | 13.869 ± 0.003 Å |
α | 84.69 ± 0.03° |
β | 83.38 ± 0.03° |
γ | 88.21 ± 0.03° |
Cell volume | 1378.3 ± 0.5 Å3 |
Cell temperature | 293 ± 2 K |
Ambient diffraction temperature | 293 ± 2 K |
Number of distinct elements | 5 |
Space group number | 2 |
Hermann-Mauguin space group symbol | P -1 |
Hall space group symbol | -P 1 |
Residual factor for all reflections | 0.0505 |
Residual factor for significantly intense reflections | 0.0497 |
Weighted residual factors for significantly intense reflections | 0.1485 |
Weighted residual factors for all reflections included in the refinement | 0.1498 |
Goodness-of-fit parameter for all reflections included in the refinement | 1.038 |
Diffraction radiation wavelength | 0.71073 Å |
Diffraction radiation type | MoKα |