Information card for entry 7012553
Formula | C35 H53 Li N2 O3 |
Calculated formula | C35 H53 Li N2 O3 |
Title of publication | Structures and reactions of monomeric and dimeric lithium diazapentadienyl complexes with electrophiles: synthesis of α-C,C'-dialkyl-β-diimines, and dissolution-reversible synthesis of an α-alkoxylithium-β-diimine |
Authors of publication | Carey, David T.; Cope-Eatough, Elaine K.; Vilaplana-Mafé, Eva; Mair, Francis S.; Pritchard, Robin G.; Warren, John E.; Woods, Rebecca J. |
Journal of publication | Dalton Transactions |
Year of publication | 2003 |
Journal issue | 6 |
Pages of publication | 1083 |
a | 32.123 ± 0.009 Å |
b | 32.123 ± 0.009 Å |
c | 9.273 ± 0.002 Å |
α | 90° |
β | 90° |
γ | 120° |
Cell volume | 8287 ± 4 Å3 |
Cell temperature | 203 ± 2 K |
Ambient diffraction temperature | 203 ± 2 K |
Number of distinct elements | 5 |
Space group number | 160 |
Hermann-Mauguin space group symbol | R 3 m :H |
Hall space group symbol | R 3 -2" |
Residual factor for all reflections | 0.1067 |
Residual factor for significantly intense reflections | 0.0605 |
Weighted residual factors for significantly intense reflections | 0.1257 |
Weighted residual factors for all reflections included in the refinement | 0.1434 |
Goodness-of-fit parameter for all reflections included in the refinement | 0.917 |
Diffraction radiation probe | x-ray |
Diffraction radiation wavelength | 0.71073 Å |
Diffraction radiation type | MoKα |