Information card for entry 7012621
Formula | C23 H29 Cl N O2 P Pd |
Calculated formula | C23 H29 Cl N O2 P Pd |
SMILES | [Pd]1(Cl)([P](OC(C)(C)C2OCC([N]1=2)(C)C)(c1ccccc1)c1ccccc1)CC=C |
Title of publication | Monohapto-allyl Pd(ii) complexes with bidentate hybrid P,N ligandsElectronic supplementary information (ESI) available: preparations and selected spectroscopic data for 1 and 4‒6. See http://www.rsc.org/suppdata/dt/b2/b212393m/ |
Authors of publication | Braunstein, Pierre; Zhang, Jing; Welter, Richard |
Journal of publication | Dalton Transactions |
Year of publication | 2003 |
Journal issue | 4 |
Pages of publication | 507 |
a | 9.952 ± 0.005 Å |
b | 12.957 ± 0.005 Å |
c | 18.271 ± 0.005 Å |
α | 89.915 ± 0.005° |
β | 89.447 ± 0.005° |
γ | 86.007 ± 0.005° |
Cell volume | 2350.2 ± 1.6 Å3 |
Cell temperature | 173 ± 2 K |
Ambient diffraction temperature | 173 ± 2 K |
Number of distinct elements | 7 |
Space group number | 2 |
Hermann-Mauguin space group symbol | P -1 |
Hall space group symbol | -P 1 |
Residual factor for all reflections | 0.0424 |
Residual factor for significantly intense reflections | 0.0335 |
Weighted residual factors for significantly intense reflections | 0.0853 |
Weighted residual factors for all reflections included in the refinement | 0.0891 |
Goodness-of-fit parameter for all reflections included in the refinement | 1.032 |
Diffraction radiation wavelength | 0.71069 Å |
Diffraction radiation type | MoKα |