Information card for entry 7012992
Formula | C12 H24 Cl2 O4 Pt Se2 |
Calculated formula | C12 H24 Cl2 O4 Pt Se2 |
SMILES | [Pt]1([Se]2CCOCCOCC[Se]1CCOCCOCC2)(Cl)Cl |
Title of publication | Synthesis and complexation of the mixed tellurium?oxygen macrocycles 1-tellura-4,7-dioxacyclononane, [9]aneO2Te, and 1,10-ditellura-4,7,13,16-tetraoxacyclooctadecane, [18]aneO4Te2 and their selenium analogues |
Authors of publication | Hesford, Matthew J.; Levason, William; Matthews, Melissa L.; Reid, Gillian |
Journal of publication | Dalton Transactions |
Year of publication | 2003 |
Journal issue | 14 |
Pages of publication | 2852 |
a | 9.1683 ± 0.0002 Å |
b | 9.582 ± 0.0002 Å |
c | 20.5132 ± 0.0005 Å |
α | 90° |
β | 90° |
γ | 90° |
Cell volume | 1802.1 ± 0.07 Å3 |
Cell temperature | 120 ± 0.1 K |
Ambient diffraction temperature | 120 ± 0.1 K |
Number of distinct elements | 6 |
Space group number | 19 |
Hermann-Mauguin space group symbol | P 21 21 21 |
Hall space group symbol | P 2ac 2ab |
Residual factor for all reflections | 0.0555 |
Residual factor for significantly intense reflections | 0.055 |
Weighted residual factors for all reflections | 0.065 |
Weighted residual factors for all reflections included in the refinement | 0.065 |
Goodness-of-fit parameter for all reflections | 2.334 |
Goodness-of-fit parameter for all reflections included in the refinement | 2.33 |
Diffraction radiation wavelength | 0.71073 Å |
Diffraction radiation type | MoKα |