Information card for entry 7015135
Formula | C18 H34 O27 Zn4 |
Calculated formula | C18 H35 O27 Zn4 |
Title of publication | Isomorphic coordination polymers of cobalt(II), zinc(II) with a flexible ligand of cis,cis,cis-1,2,3,4-cyclopentanetetracarboxylic acid and their molecular alloys: crystal structures, thermal decomposition mechanisms and magnetic properties. |
Authors of publication | Huang, Liang-Fang; Ji, Chang-Chun; Lu, Zhen-Zhong; Yao, Xiao-Qiang; Hu, Jin-Song; Zheng, He-Gen |
Journal of publication | Dalton transactions (Cambridge, England : 2003) |
Year of publication | 2011 |
Journal volume | 40 |
Journal issue | 13 |
Pages of publication | 3183 - 3190 |
a | 9.2129 ± 0.0016 Å |
b | 9.6417 ± 0.0016 Å |
c | 9.9945 ± 0.0017 Å |
α | 65.041 ± 0.003° |
β | 80.05 ± 0.003° |
γ | 66.997 ± 0.003° |
Cell volume | 740.8 ± 0.2 Å3 |
Cell temperature | 293 ± 2 K |
Ambient diffraction temperature | 293 ± 2 K |
Number of distinct elements | 4 |
Space group number | 2 |
Hermann-Mauguin space group symbol | P -1 |
Hall space group symbol | -P 1 |
Residual factor for all reflections | 0.0394 |
Residual factor for significantly intense reflections | 0.0359 |
Weighted residual factors for significantly intense reflections | 0.0986 |
Weighted residual factors for all reflections included in the refinement | 0.1004 |
Goodness-of-fit parameter for all reflections included in the refinement | 1.016 |
Diffraction radiation wavelength | 0.71073 Å |
Diffraction radiation type | MoKα |