Information card for entry 7015136
Formula | C18 H34 Co2 O27 Zn2 |
Calculated formula | C18 H34 Co2 O27 Zn2 |
Title of publication | Isomorphic coordination polymers of cobalt(II), zinc(II) with a flexible ligand of cis,cis,cis-1,2,3,4-cyclopentanetetracarboxylic acid and their molecular alloys: crystal structures, thermal decomposition mechanisms and magnetic properties. |
Authors of publication | Huang, Liang-Fang; Ji, Chang-Chun; Lu, Zhen-Zhong; Yao, Xiao-Qiang; Hu, Jin-Song; Zheng, He-Gen |
Journal of publication | Dalton transactions (Cambridge, England : 2003) |
Year of publication | 2011 |
Journal volume | 40 |
Journal issue | 13 |
Pages of publication | 3183 - 3190 |
a | 9.224 ± 0.002 Å |
b | 9.643 ± 0.002 Å |
c | 10.015 ± 0.002 Å |
α | 65.055 ± 0.004° |
β | 80.203 ± 0.004° |
γ | 67.057 ± 0.004° |
Cell volume | 743.8 ± 0.3 Å3 |
Cell temperature | 291 ± 2 K |
Ambient diffraction temperature | 291 ± 2 K |
Number of distinct elements | 5 |
Space group number | 2 |
Hermann-Mauguin space group symbol | P -1 |
Hall space group symbol | -P 1 |
Residual factor for all reflections | 0.0618 |
Residual factor for significantly intense reflections | 0.0496 |
Weighted residual factors for significantly intense reflections | 0.122 |
Weighted residual factors for all reflections included in the refinement | 0.1275 |
Goodness-of-fit parameter for all reflections included in the refinement | 1.016 |
Diffraction radiation wavelength | 0.71073 Å |
Diffraction radiation type | MoKα |