Information card for entry 7020144
Formula | C19 H24 Fe O7 |
Calculated formula | C19 H24 Fe O7 |
SMILES | [Fe]123(C#[O])(C#[O])(C#[O])[C]4(OC(=O)C(C)(C)C)[CH]1=[C]2(OC(=O)C(C)(C)C)CC[CH]3=4 |
Title of publication | Acyloxybutadiene tricarbonyl iron complexes as enzyme-triggered CO-releasing molecules (ET-CORMs): a structure-activity relationship study. |
Authors of publication | Romanski, Steffen; Kraus, Birgit; Guttentag, Miguel; Schlundt, Waldemar; Rücker, Hannelore; Adler, Andreas; Neudörfl, Jörg-Martin; Alberto, Roger; Amslinger, Sabine; Schmalz, Hans-Günther |
Journal of publication | Dalton transactions (Cambridge, England : 2003) |
Year of publication | 2012 |
Journal volume | 41 |
Journal issue | 45 |
Pages of publication | 13862 - 13875 |
a | 13.5179 ± 0.0016 Å |
b | 12.1754 ± 0.0007 Å |
c | 12.5175 ± 0.0015 Å |
α | 90° |
β | 100.201 ± 0.003° |
γ | 90° |
Cell volume | 2027.6 ± 0.4 Å3 |
Cell temperature | 100 ± 2 K |
Ambient diffraction temperature | 100 ± 2 K |
Number of distinct elements | 4 |
Space group number | 14 |
Hermann-Mauguin space group symbol | P 1 21/c 1 |
Hall space group symbol | -P 2ybc |
Residual factor for all reflections | 0.0916 |
Residual factor for significantly intense reflections | 0.0606 |
Weighted residual factors for significantly intense reflections | 0.1592 |
Weighted residual factors for all reflections included in the refinement | 0.1803 |
Goodness-of-fit parameter for all reflections included in the refinement | 1.214 |
Diffraction radiation wavelength | 0.71073 Å |
Diffraction radiation type | MoKα |