Information card for entry 7020145
Formula | C25 H38 Fe O5 |
Calculated formula | C25 H38 Fe O5 |
SMILES | [Fe]123(C#[O])(C#[O])(C#[O])[C]4(OC(=O)CCCCCCCCCCCCCCC)=[CH]1[CH]2=[CH]3CC4 |
Title of publication | Acyloxybutadiene tricarbonyl iron complexes as enzyme-triggered CO-releasing molecules (ET-CORMs): a structure-activity relationship study. |
Authors of publication | Romanski, Steffen; Kraus, Birgit; Guttentag, Miguel; Schlundt, Waldemar; Rücker, Hannelore; Adler, Andreas; Neudörfl, Jörg-Martin; Alberto, Roger; Amslinger, Sabine; Schmalz, Hans-Günther |
Journal of publication | Dalton transactions (Cambridge, England : 2003) |
Year of publication | 2012 |
Journal volume | 41 |
Journal issue | 45 |
Pages of publication | 13862 - 13875 |
a | 6.6635 ± 0.0014 Å |
b | 6.7003 ± 0.0015 Å |
c | 28.213 ± 0.006 Å |
α | 85.849 ± 0.005° |
β | 86.939 ± 0.006° |
γ | 82.03 ± 0.007° |
Cell volume | 1243 ± 0.5 Å3 |
Cell temperature | 100 ± 2 K |
Ambient diffraction temperature | 100 ± 2 K |
Number of distinct elements | 4 |
Space group number | 2 |
Hermann-Mauguin space group symbol | P -1 |
Hall space group symbol | -P 1 |
Residual factor for all reflections | 0.1435 |
Residual factor for significantly intense reflections | 0.0745 |
Weighted residual factors for significantly intense reflections | 0.1718 |
Weighted residual factors for all reflections included in the refinement | 0.2007 |
Goodness-of-fit parameter for all reflections included in the refinement | 1.025 |
Diffraction radiation wavelength | 0.71073 Å |
Diffraction radiation type | MoKα |