Information card for entry 7025114
Formula | C11 H11 N5 |
Calculated formula | C11 H11 N5 |
SMILES | n1ccccc1N/N=C(\N)c1ncccc1 |
Title of publication | Triazolopyridines as ligands: structural diversity in iron(II), cobalt(II), nickel(II) and copper(II) complexes of 3-(2-pyridyl)-[1,2,4]triazolo[4,3-a]- pyridine (L¹⁰) and spin crossover in [Fe(II)(L¹⁰)₂(NCS)₂]. |
Authors of publication | Klingele, Julia; Kaase, Dominic; Hilgert, Jakob; Steinfeld, Gunther; Klingele, Marco H.; Lach, Jochen |
Journal of publication | Dalton transactions (Cambridge, England : 2003) |
Year of publication | 2010 |
Journal volume | 39 |
Journal issue | 19 |
Pages of publication | 4495 - 4507 |
a | 12.178 ± 0.002 Å |
b | 12.462 ± 0.003 Å |
c | 14.973 ± 0.003 Å |
α | 90° |
β | 113.15 ± 0.03° |
γ | 90° |
Cell volume | 2089.4 ± 0.9 Å3 |
Cell temperature | 120 ± 2 K |
Ambient diffraction temperature | 120 ± 2 K |
Number of distinct elements | 3 |
Space group number | 14 |
Hermann-Mauguin space group symbol | P 1 21/c 1 |
Hall space group symbol | -P 2ybc |
Residual factor for all reflections | 0.0749 |
Residual factor for significantly intense reflections | 0.0421 |
Weighted residual factors for significantly intense reflections | 0.0962 |
Weighted residual factors for all reflections included in the refinement | 0.1117 |
Goodness-of-fit parameter for all reflections included in the refinement | 1.017 |
Diffraction radiation wavelength | 0.71073 Å |
Diffraction radiation type | MoKα |