Information card for entry 7025115
Formula | C28 H23 F6 Mn2 N4 O7 P |
Calculated formula | C28 H23 F6 Mn2 N4 O7 P |
Title of publication | Structural diversity in manganese, iron and cobalt complexes of the ditopic 1,2-bis(2,2'-bipyridyl-6-yl)ethyne ligand and observation of epoxidation and catalase activity of manganese compounds. |
Authors of publication | Madhu, Vedichi; Ekambaram, Balaraman; Shimon, Linda J. W.; Diskin, Yael; Leitus, Gregory; Neumann, Ronny |
Journal of publication | Dalton transactions (Cambridge, England : 2003) |
Year of publication | 2010 |
Journal volume | 39 |
Journal issue | 31 |
Pages of publication | 7266 - 7275 |
a | 8.5423 ± 0.0001 Å |
b | 12.9101 ± 0.0002 Å |
c | 27.6759 ± 0.0004 Å |
α | 90° |
β | 91.0314 ± 0.0005° |
γ | 90° |
Cell volume | 3051.66 ± 0.07 Å3 |
Cell temperature | 120 ± 2 K |
Ambient diffraction temperature | 120 ± 2 K |
Number of distinct elements | 7 |
Space group number | 14 |
Hermann-Mauguin space group symbol | P 1 21/c 1 |
Hall space group symbol | -P 2ybc |
Residual factor for all reflections | 0.0794 |
Residual factor for significantly intense reflections | 0.0487 |
Weighted residual factors for significantly intense reflections | 0.1268 |
Weighted residual factors for all reflections included in the refinement | 0.1393 |
Goodness-of-fit parameter for all reflections included in the refinement | 1.056 |
Diffraction radiation wavelength | 0.71073 Å |
Diffraction radiation type | MoKα |