Information card for entry 7025116
Formula | C35 H42 F6 Mn2 N7 O8 P |
Calculated formula | C35 H42 F6 Mn2 N7 O8 P |
Title of publication | Structural diversity in manganese, iron and cobalt complexes of the ditopic 1,2-bis(2,2'-bipyridyl-6-yl)ethyne ligand and observation of epoxidation and catalase activity of manganese compounds. |
Authors of publication | Madhu, Vedichi; Ekambaram, Balaraman; Shimon, Linda J. W.; Diskin, Yael; Leitus, Gregory; Neumann, Ronny |
Journal of publication | Dalton transactions (Cambridge, England : 2003) |
Year of publication | 2010 |
Journal volume | 39 |
Journal issue | 31 |
Pages of publication | 7266 - 7275 |
a | 7.9468 ± 0.0001 Å |
b | 20.3942 ± 0.0002 Å |
c | 12.6593 ± 0.0003 Å |
α | 90° |
β | 95.704 ± 0.0009° |
γ | 90° |
Cell volume | 2041.52 ± 0.06 Å3 |
Cell temperature | 120 ± 2 K |
Ambient diffraction temperature | 120 ± 2 K |
Number of distinct elements | 7 |
Space group number | 11 |
Hermann-Mauguin space group symbol | P 1 21/m 1 |
Hall space group symbol | -P 2yb |
Residual factor for all reflections | 0.0641 |
Residual factor for significantly intense reflections | 0.051 |
Weighted residual factors for significantly intense reflections | 0.1296 |
Weighted residual factors for all reflections included in the refinement | 0.1394 |
Goodness-of-fit parameter for all reflections included in the refinement | 1.002 |
Diffraction radiation wavelength | 0.71073 Å |
Diffraction radiation type | MoKα |