Information card for entry 7025318
Formula | C85 H160 Dy4 Mn4 N9.6 O40 |
Calculated formula | C85 H144 Dy4 Mn4 N9.6 O40 |
Title of publication | Structures and magnetic properties of Mn(III)₄Ln(III)₄ aggregates with a "square-in-square" topology. |
Authors of publication | Mereacre, Valeriu; Akhtar, Muhammad Nadeem; Lan, Yanhua; Ako, Ayuk M.; Clérac, Rodolphe; Anson, Christopher E.; Powell, Annie K. |
Journal of publication | Dalton transactions (Cambridge, England : 2003) |
Year of publication | 2010 |
Journal volume | 39 |
Journal issue | 20 |
Pages of publication | 4918 - 4927 |
a | 16.4245 ± 0.0005 Å |
b | 35.3485 ± 0.0011 Å |
c | 21.1567 ± 0.0007 Å |
α | 90° |
β | 111.638 ± 0.001° |
γ | 90° |
Cell volume | 11417.6 ± 0.6 Å3 |
Cell temperature | 100 ± 2 K |
Ambient diffraction temperature | 100 ± 2 K |
Number of distinct elements | 6 |
Space group number | 14 |
Hermann-Mauguin space group symbol | P 1 21/n 1 |
Hall space group symbol | -P 2yn |
Residual factor for all reflections | 0.0879 |
Residual factor for significantly intense reflections | 0.0553 |
Weighted residual factors for significantly intense reflections | 0.132 |
Weighted residual factors for all reflections included in the refinement | 0.1516 |
Goodness-of-fit parameter for all reflections included in the refinement | 1.1 |
Diffraction radiation wavelength | 0.71073 Å |
Diffraction radiation type | MoKα |