Information card for entry 7025319
Formula | C79.5 H154 Er4 Mn4 N10 O40 |
Calculated formula | C79.5 H144 Er4 Mn4 N10 O40 |
Title of publication | Structures and magnetic properties of Mn(III)₄Ln(III)₄ aggregates with a "square-in-square" topology. |
Authors of publication | Mereacre, Valeriu; Akhtar, Muhammad Nadeem; Lan, Yanhua; Ako, Ayuk M.; Clérac, Rodolphe; Anson, Christopher E.; Powell, Annie K. |
Journal of publication | Dalton transactions (Cambridge, England : 2003) |
Year of publication | 2010 |
Journal volume | 39 |
Journal issue | 20 |
Pages of publication | 4918 - 4927 |
a | 16.3599 ± 0.0004 Å |
b | 35.3345 ± 0.0009 Å |
c | 21.1554 ± 0.0006 Å |
α | 90° |
β | 111.506 ± 0.001° |
γ | 90° |
Cell volume | 11377.9 ± 0.5 Å3 |
Cell temperature | 100 ± 2 K |
Ambient diffraction temperature | 100 ± 2 K |
Number of distinct elements | 6 |
Space group number | 14 |
Hermann-Mauguin space group symbol | P 1 21/n 1 |
Hall space group symbol | -P 2yn |
Residual factor for all reflections | 0.07 |
Residual factor for significantly intense reflections | 0.052 |
Weighted residual factors for significantly intense reflections | 0.1308 |
Weighted residual factors for all reflections included in the refinement | 0.143 |
Goodness-of-fit parameter for all reflections included in the refinement | 1.084 |
Diffraction radiation wavelength | 0.71073 Å |
Diffraction radiation type | MoKα |