Information card for entry 7028422
Formula | C5 H12 F2 N2 |
Calculated formula | C5 H12 F2 N2 |
SMILES | FC(F)(N(C)C)N(C)C |
Title of publication | Carbene complexes of phosphorus(v) fluorides substituted with perfluoroalkyl-groups synthesized by oxidative addition. Cleavage of the complexes reveals a new synthetic protocol for ionic liquids. |
Authors of publication | Böttcher, Tobias; Steinhauer, Simon; Allefeld, Nadine; Hoge, Berthold; Neumann, Beate; Stammler, Hans Georg; Bassil, Bassem S.; Winter, Martin; Mitzel, Norbert W.; Röschenthaler, Gerd-Volker |
Journal of publication | Dalton transactions (Cambridge, England : 2003) |
Year of publication | 2014 |
Journal volume | 43 |
Journal issue | 7 |
Pages of publication | 2979 - 2987 |
a | 15.251 ± 0.004 Å |
b | 15.894 ± 0.004 Å |
c | 5.8246 ± 0.0018 Å |
α | 90° |
β | 90° |
γ | 90° |
Cell volume | 1411.9 ± 0.7 Å3 |
Cell temperature | 100 ± 2 K |
Ambient diffraction temperature | 100 ± 2 K |
Number of distinct elements | 4 |
Space group number | 43 |
Hermann-Mauguin space group symbol | F d d 2 |
Hall space group symbol | F 2 -2d |
Residual factor for all reflections | 0.0384 |
Residual factor for significantly intense reflections | 0.0289 |
Weighted residual factors for significantly intense reflections | 0.0541 |
Weighted residual factors for all reflections included in the refinement | 0.0572 |
Goodness-of-fit parameter for all reflections included in the refinement | 1.165 |
Diffraction radiation wavelength | 0.71073 Å |
Diffraction radiation type | MoKα |