Information card for entry 7028423
Formula | C5 H10 Cl2 N2 |
Calculated formula | C5 H10 Cl2 N2 |
SMILES | C1(=[N+](CCN1C)C)Cl.[Cl-] |
Title of publication | Carbene complexes of phosphorus(v) fluorides substituted with perfluoroalkyl-groups synthesized by oxidative addition. Cleavage of the complexes reveals a new synthetic protocol for ionic liquids. |
Authors of publication | Böttcher, Tobias; Steinhauer, Simon; Allefeld, Nadine; Hoge, Berthold; Neumann, Beate; Stammler, Hans Georg; Bassil, Bassem S.; Winter, Martin; Mitzel, Norbert W.; Röschenthaler, Gerd-Volker |
Journal of publication | Dalton transactions (Cambridge, England : 2003) |
Year of publication | 2014 |
Journal volume | 43 |
Journal issue | 7 |
Pages of publication | 2979 - 2987 |
a | 12.203 ± 0.003 Å |
b | 8.517 ± 0.002 Å |
c | 7.388 ± 0.003 Å |
α | 90° |
β | 90° |
γ | 90° |
Cell volume | 767.9 ± 0.4 Å3 |
Cell temperature | 173 ± 2 K |
Ambient diffraction temperature | 173 ± 2 K |
Number of distinct elements | 4 |
Space group number | 62 |
Hermann-Mauguin space group symbol | P n m a |
Hall space group symbol | -P 2ac 2n |
Residual factor for all reflections | 0.0876 |
Residual factor for significantly intense reflections | 0.076 |
Weighted residual factors for significantly intense reflections | 0.197 |
Weighted residual factors for all reflections included in the refinement | 0.2072 |
Goodness-of-fit parameter for all reflections included in the refinement | 1.006 |
Diffraction radiation wavelength | 0.71073 Å |
Diffraction radiation type | MoKα |