Information card for entry 7028585
Formula | C44 H40 Ag N9 O3 |
Calculated formula | C44 H40 Ag N9 O3 |
Title of publication | Silver(I) supramolecular complexes generated from isophorone-based ligands: crystal structures and enhanced nonlinear optical properties through metal complexation. |
Authors of publication | Zheng, Zheng; Yu, Zhi-Peng; Yang, Ming-Di; Jin, Feng; Ye, Li-Na; Fang, Min; Zhou, Hong-Ping; Wu, Jie-Ying; Tian, Yu-Peng |
Journal of publication | Dalton transactions (Cambridge, England : 2003) |
Year of publication | 2014 |
Journal volume | 43 |
Journal issue | 3 |
Pages of publication | 1139 - 1150 |
a | 7.727 ± 0.005 Å |
b | 32.015 ± 0.005 Å |
c | 8.917 ± 0.005 Å |
α | 90 ± 0.005° |
β | 112.829 ± 0.005° |
γ | 90 ± 0.005° |
Cell volume | 2033.1 ± 1.8 Å3 |
Cell temperature | 298 ± 2 K |
Ambient diffraction temperature | 298 ± 2 K |
Number of distinct elements | 5 |
Space group number | 14 |
Hermann-Mauguin space group symbol | P 1 21/c 1 |
Hall space group symbol | -P 2ybc |
Residual factor for all reflections | 0.0656 |
Residual factor for significantly intense reflections | 0.0524 |
Weighted residual factors for significantly intense reflections | 0.1542 |
Weighted residual factors for all reflections included in the refinement | 0.1702 |
Goodness-of-fit parameter for all reflections included in the refinement | 1.038 |
Diffraction radiation wavelength | 0.71069 Å |
Diffraction radiation type | MoKα |