Information card for entry 7028586
Formula | C50 H46 Ag N9 O3 |
Calculated formula | C50 H46 Ag N9 O3 |
Title of publication | Silver(I) supramolecular complexes generated from isophorone-based ligands: crystal structures and enhanced nonlinear optical properties through metal complexation. |
Authors of publication | Zheng, Zheng; Yu, Zhi-Peng; Yang, Ming-Di; Jin, Feng; Ye, Li-Na; Fang, Min; Zhou, Hong-Ping; Wu, Jie-Ying; Tian, Yu-Peng |
Journal of publication | Dalton transactions (Cambridge, England : 2003) |
Year of publication | 2014 |
Journal volume | 43 |
Journal issue | 3 |
Pages of publication | 1139 - 1150 |
a | 6.991 ± 0.014 Å |
b | 13.22 ± 0.03 Å |
c | 13.23 ± 0.03 Å |
α | 80.11 ± 0.02° |
β | 81.34 ± 0.02° |
γ | 77.57 ± 0.02° |
Cell volume | 1168 ± 4 Å3 |
Cell temperature | 293 ± 2 K |
Ambient diffraction temperature | 293 ± 2 K |
Number of distinct elements | 5 |
Space group number | 2 |
Hermann-Mauguin space group symbol | P -1 |
Hall space group symbol | -P 1 |
Residual factor for all reflections | 0.0531 |
Residual factor for significantly intense reflections | 0.0459 |
Weighted residual factors for significantly intense reflections | 0.1199 |
Weighted residual factors for all reflections included in the refinement | 0.1249 |
Goodness-of-fit parameter for all reflections included in the refinement | 1.057 |
Diffraction radiation wavelength | 0.71073 Å |
Diffraction radiation type | MoKα |