Information card for entry 7030196
Formula | C43.2 H51 Cl2 Dy N12 Ni O15.8 |
Calculated formula | C43.2 H43.5 Cl2 Dy N12 Ni O15.8 |
Title of publication | Employment of methyl 2-pyridyl ketone oxime in 3d/4f-metal chemistry: dinuclear nickel(II)/lanthanide(III) species and complexes containing the metals in separate ions. |
Authors of publication | Polyzou, Christina D.; Nikolaou, Helen; Papatriantafyllopoulou, Constantina; Psycharis, Vassilis; Terzis, Aris; Raptopoulou, Catherine P.; Escuer, Albert; Perlepes, Spyros P. |
Journal of publication | Dalton transactions (Cambridge, England : 2003) |
Year of publication | 2012 |
Journal volume | 41 |
Journal issue | 44 |
Pages of publication | 13755 - 13764 |
a | 15.7617 ± 0.0003 Å |
b | 26.1482 ± 0.0005 Å |
c | 26.3339 ± 0.0005 Å |
α | 90° |
β | 105.307 ± 0.001° |
γ | 90° |
Cell volume | 10468.2 ± 0.3 Å3 |
Cell temperature | 160 ± 2 K |
Ambient diffraction temperature | 160 ± 2 K |
Number of distinct elements | 7 |
Space group number | 14 |
Hermann-Mauguin space group symbol | P 1 21/a 1 |
Hall space group symbol | -P 2yab |
Residual factor for all reflections | 0.1008 |
Residual factor for significantly intense reflections | 0.0798 |
Weighted residual factors for significantly intense reflections | 0.2123 |
Weighted residual factors for all reflections included in the refinement | 0.2336 |
Goodness-of-fit parameter for all reflections included in the refinement | 1.059 |
Diffraction radiation wavelength | 1.5418 Å |
Diffraction radiation type | CuKα |