Information card for entry 7030197
Formula | C44 H56 Cl La N18 Ni2 O30 |
Calculated formula | C44 H48 Cl La N18 Ni2 O30.06 |
Title of publication | Employment of methyl 2-pyridyl ketone oxime in 3d/4f-metal chemistry: dinuclear nickel(II)/lanthanide(III) species and complexes containing the metals in separate ions. |
Authors of publication | Polyzou, Christina D.; Nikolaou, Helen; Papatriantafyllopoulou, Constantina; Psycharis, Vassilis; Terzis, Aris; Raptopoulou, Catherine P.; Escuer, Albert; Perlepes, Spyros P. |
Journal of publication | Dalton transactions (Cambridge, England : 2003) |
Year of publication | 2012 |
Journal volume | 41 |
Journal issue | 44 |
Pages of publication | 13755 - 13764 |
a | 13.4798 ± 0.0002 Å |
b | 13.4798 ± 0.0005 Å |
c | 30.005 ± 0.0002 Å |
α | 90° |
β | 90° |
γ | 120° |
Cell volume | 4721.62 ± 0.19 Å3 |
Cell temperature | 160 ± 2 K |
Ambient diffraction temperature | 160 ± 2 K |
Number of distinct elements | 7 |
Space group number | 148 |
Hermann-Mauguin space group symbol | R -3 :H |
Hall space group symbol | -R 3 |
Residual factor for all reflections | 0.0281 |
Residual factor for significantly intense reflections | 0.0281 |
Weighted residual factors for significantly intense reflections | 0.073 |
Weighted residual factors for all reflections included in the refinement | 0.073 |
Goodness-of-fit parameter for all reflections included in the refinement | 1.068 |
Diffraction radiation wavelength | 1.54178 Å |
Diffraction radiation type | CuKα |