Information card for entry 7031809
Formula | C30 H22 Cl2 N2 O4 Pt |
Calculated formula | C30 H22 Cl2 N2 O4 Pt |
SMILES | C1(=C(C(=O)c2ccccc2O1)[NH2][Pt](Cl)([NH2]C1=C(Oc2ccccc2C1=O)c1ccccc1)Cl)c1ccccc1 |
Title of publication | trans-Platinum(II) complex of 3-aminoflavone - synthesis, X-ray crystal structure and biological activities in vitro. |
Authors of publication | Fabijańska, Małgorzata; Studzian, Kazimierz; Szmigiero, Leszek; Rybarczyk-Pirek, Agnieszka J; Pfitzner, Arno; Cebula-Obrzut, Barbara; Smolewski, Piotr; Zyner, Elżbieta; Ochocki, Justyn |
Journal of publication | Dalton transactions (Cambridge, England : 2003) |
Year of publication | 2015 |
Journal volume | 44 |
Journal issue | 3 |
Pages of publication | 938 - 947 |
a | 6.9226 ± 0.0004 Å |
b | 9.2809 ± 0.0008 Å |
c | 11.0038 ± 0.0009 Å |
α | 85.511 ± 0.007° |
β | 87.997 ± 0.006° |
γ | 77.091 ± 0.007° |
Cell volume | 686.88 ± 0.09 Å3 |
Cell temperature | 123 ± 2 K |
Ambient diffraction temperature | 123 ± 2 K |
Number of distinct elements | 6 |
Space group number | 2 |
Hermann-Mauguin space group symbol | P -1 |
Hall space group symbol | -P 1 |
Residual factor for all reflections | 0.0347 |
Residual factor for significantly intense reflections | 0.0309 |
Weighted residual factors for significantly intense reflections | 0.0742 |
Weighted residual factors for all reflections included in the refinement | 0.0811 |
Goodness-of-fit parameter for all reflections included in the refinement | 1.144 |
Diffraction radiation wavelength | 1.54178 Å |
Diffraction radiation type | CuKα |