Information card for entry 7033135
Common name | sodium calcium barium phosphate |
Chemical name | disodium monocalcium monobarium phosphate |
Formula | Ba Ca Na2 O8 P2 |
Calculated formula | Ba Ca Na2 O8 P2 |
Title of publication | Crystal structures and luminescence properties of Eu²⁺-activated new NaBa0.5Ca0.5PO₄ and Na₃Ba₂Ca(PO₄)₃. |
Authors of publication | Kim, Minsung; Kobayashi, Makoto; Kato, Hideki; Yamane, Hisanori; Sato, Yasushi; Kakihana, Masato |
Journal of publication | Dalton transactions (Cambridge, England : 2003) |
Year of publication | 2015 |
Journal volume | 44 |
Journal issue | 4 |
Pages of publication | 1900 - 1904 |
a | 5.4474 ± 0.0004 Å |
b | 5.4474 ± 0.0004 Å |
c | 7.3624 ± 0.0005 Å |
α | 90° |
β | 90° |
γ | 120° |
Cell volume | 189.2 ± 0.02 Å3 |
Cell temperature | 293 ± 2 K |
Ambient diffraction temperature | 293 ± 2 K |
Number of distinct elements | 5 |
Space group number | 164 |
Hermann-Mauguin space group symbol | P -3 m 1 |
Hall space group symbol | -P 3 2" |
Residual factor for all reflections | 0.0168 |
Residual factor for significantly intense reflections | 0.0168 |
Weighted residual factors for significantly intense reflections | 0.0408 |
Weighted residual factors for all reflections included in the refinement | 0.0408 |
Goodness-of-fit parameter for all reflections included in the refinement | 1.154 |
Diffraction radiation wavelength | 0.71075 Å |
Diffraction radiation type | MoKα |