Information card for entry 7033483
Formula | C14 H14 Cd Cl2 N2 O |
Calculated formula | C14 H14 Cd Cl2 N2 O |
SMILES | [Cd]1(Cl)(Cl)[n]2c(C=[N]1c1ccc(cc1)C)cccc2OC |
Title of publication | Synthesis and characterization of substituted Schiff-base ligands and their d(10) metal complexes: structure-induced luminescence tuning behaviors and applications in co-sensitized solar cells. |
Authors of publication | Dong, Yu-Wei; Fan, Rui-Qing; Wang, Ping; Wei, Li-Guo; Wang, Xin-Ming; Zhang, Hui-Jie; Gao, Song; Yang, Yu-Lin; Wang, Yu-Lei |
Journal of publication | Dalton transactions (Cambridge, England : 2003) |
Year of publication | 2015 |
Journal volume | 44 |
Journal issue | 12 |
Pages of publication | 5306 - 5322 |
a | 8.0765 ± 0.0005 Å |
b | 9.3574 ± 0.0005 Å |
c | 10.5442 ± 0.0005 Å |
α | 94.409 ± 0.004° |
β | 93.636 ± 0.004° |
γ | 92.85 ± 0.004° |
Cell volume | 791.73 ± 0.08 Å3 |
Cell temperature | 293 ± 2 K |
Ambient diffraction temperature | 293 ± 2 K |
Number of distinct elements | 6 |
Space group number | 2 |
Hermann-Mauguin space group symbol | P -1 |
Hall space group symbol | -P 1 |
Residual factor for all reflections | 0.0431 |
Residual factor for significantly intense reflections | 0.0337 |
Weighted residual factors for significantly intense reflections | 0.071 |
Weighted residual factors for all reflections included in the refinement | 0.0783 |
Goodness-of-fit parameter for all reflections included in the refinement | 1.037 |
Diffraction radiation wavelength | 0.71073 Å |
Diffraction radiation type | MoKα |