Information card for entry 7033484
Formula | C14 H14 Cl2 Hg N2 O |
Calculated formula | C14 H14 Cl2 Hg N2 O |
SMILES | [Hg]1(Cl)(Cl)[n]2c(cccc2OC)C=[N]1c1ccc(cc1)C |
Title of publication | Synthesis and characterization of substituted Schiff-base ligands and their d(10) metal complexes: structure-induced luminescence tuning behaviors and applications in co-sensitized solar cells. |
Authors of publication | Dong, Yu-Wei; Fan, Rui-Qing; Wang, Ping; Wei, Li-Guo; Wang, Xin-Ming; Zhang, Hui-Jie; Gao, Song; Yang, Yu-Lin; Wang, Yu-Lei |
Journal of publication | Dalton transactions (Cambridge, England : 2003) |
Year of publication | 2015 |
Journal volume | 44 |
Journal issue | 12 |
Pages of publication | 5306 - 5322 |
a | 7.9723 ± 0.0005 Å |
b | 9.355 ± 0.0005 Å |
c | 10.6022 ± 0.001 Å |
α | 94.084 ± 0.006° |
β | 93.391 ± 0.006° |
γ | 93.839 ± 0.005° |
Cell volume | 785.32 ± 0.1 Å3 |
Cell temperature | 293 ± 2 K |
Ambient diffraction temperature | 293 ± 2 K |
Number of distinct elements | 6 |
Space group number | 2 |
Hermann-Mauguin space group symbol | P -1 |
Hall space group symbol | -P 1 |
Residual factor for all reflections | 0.0608 |
Residual factor for significantly intense reflections | 0.053 |
Weighted residual factors for significantly intense reflections | 0.1125 |
Weighted residual factors for all reflections included in the refinement | 0.1221 |
Goodness-of-fit parameter for all reflections included in the refinement | 1.046 |
Diffraction radiation wavelength | 0.71073 Å |
Diffraction radiation type | MoKα |