Information card for entry 7033608
Chemical name | InPCF-1 |
Formula | C14 H11 In O10 P |
Calculated formula | C14 H11 In O10 P |
Title of publication | A highly stable indium phosphonocarboxylate framework as a multifunctional sensor for Cu(2+) and methylviologen ions. |
Authors of publication | Dan, Wenyan; Liu, Xiaofeng; Deng, Mingli; Ling, Yun; Chen, Zhenxia; Zhou, Yaming |
Journal of publication | Dalton transactions (Cambridge, England : 2003) |
Year of publication | 2015 |
Journal volume | 44 |
Journal issue | 8 |
Pages of publication | 3794 - 3800 |
a | 23.474 ± 0.003 Å |
b | 23.474 ± 0.003 Å |
c | 6.6926 ± 0.0009 Å |
α | 90° |
β | 90° |
γ | 90° |
Cell volume | 3687.8 ± 0.8 Å3 |
Cell temperature | 296 ± 2 K |
Ambient diffraction temperature | 296 ± 2 K |
Number of distinct elements | 5 |
Space group number | 128 |
Hermann-Mauguin space group symbol | P 4/m n c |
Hall space group symbol | -P 4 2n |
Residual factor for all reflections | 0.072 |
Residual factor for significantly intense reflections | 0.0462 |
Weighted residual factors for significantly intense reflections | 0.1175 |
Weighted residual factors for all reflections included in the refinement | 0.1432 |
Goodness-of-fit parameter for all reflections included in the refinement | 1.175 |
Diffraction radiation wavelength | 0.71073 Å |
Diffraction radiation type | MoKα |