Information card for entry 7033717
Formula | C31 H32 Fe N5 O3 S |
Calculated formula | C31 H32 Fe N5 O3 S |
SMILES | c12ccc3ccccc3c1C=[N]1CC[NH]3CCC[N]4=Cc5c(ccc6ccccc56)O[Fe]134(N=C=S)O2.CN(C)C=O |
Title of publication | The relationship between the strength of hydrogen bonding and spin crossover behaviour in a series of iron(iii) Schiff base complexes. |
Authors of publication | Nemec, Ivan; Herchel, Radovan; Trávníček, Zdeněk |
Journal of publication | Dalton transactions (Cambridge, England : 2003) |
Year of publication | 2015 |
Journal volume | 44 |
Journal issue | 10 |
Pages of publication | 4474 - 4484 |
a | 10.2153 ± 0.0006 Å |
b | 11.1783 ± 0.0006 Å |
c | 13.2477 ± 0.0006 Å |
α | 100.939 ± 0.004° |
β | 93.011 ± 0.004° |
γ | 93.339 ± 0.004° |
Cell volume | 1479.62 ± 0.14 Å3 |
Cell temperature | 298 ± 2 K |
Ambient diffraction temperature | 298 ± 2 K |
Number of distinct elements | 6 |
Space group number | 2 |
Hermann-Mauguin space group symbol | P -1 |
Hall space group symbol | -P 1 |
Residual factor for all reflections | 0.0802 |
Residual factor for significantly intense reflections | 0.0522 |
Weighted residual factors for significantly intense reflections | 0.1416 |
Weighted residual factors for all reflections included in the refinement | 0.15 |
Goodness-of-fit parameter for all reflections included in the refinement | 1.03 |
Diffraction radiation wavelength | 0.71073 Å |
Diffraction radiation type | MoKα |