Information card for entry 7033718
Formula | C31 H32 Fe N5 O3 Se |
Calculated formula | C31 H32 Fe N5 O3 Se |
SMILES | c12c(c3c(cccc3)cc2)C=[N]2CC[NH]3CCC[N]4=Cc5c6ccccc6ccc5O[Fe]234([N]=C=[Se])O1.CN(C)C=O |
Title of publication | The relationship between the strength of hydrogen bonding and spin crossover behaviour in a series of iron(iii) Schiff base complexes. |
Authors of publication | Nemec, Ivan; Herchel, Radovan; Trávníček, Zdeněk |
Journal of publication | Dalton transactions (Cambridge, England : 2003) |
Year of publication | 2015 |
Journal volume | 44 |
Journal issue | 10 |
Pages of publication | 4474 - 4484 |
a | 10.2841 ± 0.0003 Å |
b | 11.2785 ± 0.0003 Å |
c | 13.2216 ± 0.0004 Å |
α | 101.184 ± 0.003° |
β | 93.834 ± 0.003° |
γ | 92.497 ± 0.002° |
Cell volume | 1498.57 ± 0.08 Å3 |
Cell temperature | 308 ± 2 K |
Ambient diffraction temperature | 308 ± 2 K |
Number of distinct elements | 6 |
Space group number | 2 |
Hermann-Mauguin space group symbol | P -1 |
Hall space group symbol | -P 1 |
Residual factor for all reflections | 0.0855 |
Residual factor for significantly intense reflections | 0.0467 |
Weighted residual factors for significantly intense reflections | 0.1127 |
Weighted residual factors for all reflections included in the refinement | 0.1201 |
Goodness-of-fit parameter for all reflections included in the refinement | 0.913 |
Diffraction radiation wavelength | 0.71073 Å |
Diffraction radiation type | MoKα |