Information card for entry 7033741
Formula | C28 H24 F12 N4 O3 S |
Calculated formula | C28 H24 F12 N4 O3 S |
Title of publication | Anion complexation, transport and structural studies of a series of bis-methylurea compounds. |
Authors of publication | Olivari, Martina; Montis, Riccardo; Karagiannidis, Louise E.; Horton, Peter N.; Mapp, Lucy K.; Coles, Simon J.; Light, Mark E.; Gale, Philip A.; Caltagirone, Claudia |
Journal of publication | Dalton transactions (Cambridge, England : 2003) |
Year of publication | 2015 |
Journal volume | 44 |
Journal issue | 5 |
Pages of publication | 2138 - 2149 |
a | 26.454 ± 0.002 Å |
b | 12.7445 ± 0.0009 Å |
c | 8.9389 ± 0.0005 Å |
α | 90° |
β | 94.842 ± 0.003° |
γ | 90° |
Cell volume | 3002.9 ± 0.4 Å3 |
Cell temperature | 100 ± 2 K |
Ambient diffraction temperature | 100 ± 2 K |
Number of distinct elements | 6 |
Space group number | 15 |
Hermann-Mauguin space group symbol | C 1 2/c 1 |
Hall space group symbol | -C 2yc |
Residual factor for all reflections | 0.0908 |
Residual factor for significantly intense reflections | 0.0751 |
Weighted residual factors for significantly intense reflections | 0.1893 |
Weighted residual factors for all reflections included in the refinement | 0.2007 |
Goodness-of-fit parameter for all reflections included in the refinement | 1.077 |
Diffraction radiation wavelength | 0.71075 Å |
Diffraction radiation type | MoKα |