Information card for entry 7033742
Formula | C25 H17 F12 N5 O2 |
Calculated formula | C25 H17 F12 N5 O2 |
Title of publication | Anion complexation, transport and structural studies of a series of bis-methylurea compounds. |
Authors of publication | Olivari, Martina; Montis, Riccardo; Karagiannidis, Louise E.; Horton, Peter N.; Mapp, Lucy K.; Coles, Simon J.; Light, Mark E.; Gale, Philip A.; Caltagirone, Claudia |
Journal of publication | Dalton transactions (Cambridge, England : 2003) |
Year of publication | 2015 |
Journal volume | 44 |
Journal issue | 5 |
Pages of publication | 2138 - 2149 |
a | 11.4364 ± 0.0009 Å |
b | 12.8183 ± 0.001 Å |
c | 9.0313 ± 0.0007 Å |
α | 90° |
β | 100.463 ± 0.002° |
γ | 90° |
Cell volume | 1301.93 ± 0.18 Å3 |
Cell temperature | 100 ± 2 K |
Ambient diffraction temperature | 100 ± 2 K |
Number of distinct elements | 5 |
Space group number | 13 |
Hermann-Mauguin space group symbol | P 1 2/c 1 |
Hall space group symbol | -P 2yc |
Residual factor for all reflections | 0.0465 |
Residual factor for significantly intense reflections | 0.0381 |
Weighted residual factors for significantly intense reflections | 0.0974 |
Weighted residual factors for all reflections included in the refinement | 0.1025 |
Goodness-of-fit parameter for all reflections included in the refinement | 1.037 |
Diffraction radiation wavelength | 0.71075 Å |
Diffraction radiation type | MoKα |