Information card for entry 7033750
Formula | C32 H37 F12 N6 Na O12 |
Calculated formula | C32 H37 F12 N6 Na O12 |
Title of publication | Stable Mn(2+), Cu(2+) and Ln(3+) complexes with cyclen-based ligands functionalized with picolinate pendant arms. |
Authors of publication | Rodríguez-Rodríguez, Aurora; Garda, Zoltán; Ruscsák, Erika; Esteban-Gómez, David; de Blas, Andrés; Rodríguez-Blas, Teresa; Lima, Luís M P; Beyler, Maryline; Tripier, Raphaël; Tircsó, Gyula; Platas-Iglesias, Carlos |
Journal of publication | Dalton transactions (Cambridge, England : 2003) |
Year of publication | 2015 |
Journal volume | 44 |
Journal issue | 11 |
Pages of publication | 5017 - 5031 |
a | 20.412 ± 0.002 Å |
b | 9.4077 ± 0.001 Å |
c | 21.531 ± 0.003 Å |
α | 90° |
β | 101.241 ± 0.006° |
γ | 90° |
Cell volume | 4055.3 ± 0.8 Å3 |
Cell temperature | 100 ± 2 K |
Ambient diffraction temperature | 100 ± 2 K |
Number of distinct elements | 6 |
Space group number | 14 |
Hermann-Mauguin space group symbol | P 1 21/c 1 |
Hall space group symbol | -P 2ybc |
Residual factor for all reflections | 0.0865 |
Residual factor for significantly intense reflections | 0.0626 |
Weighted residual factors for significantly intense reflections | 0.164 |
Weighted residual factors for all reflections included in the refinement | 0.1827 |
Goodness-of-fit parameter for all reflections included in the refinement | 1.036 |
Diffraction radiation probe | x-ray |
Diffraction radiation wavelength | 0.71073 Å |
Diffraction radiation type | MoKα |