Information card for entry 7033751
Formula | C18 B2 Cl6 F10 Fe N6 O6 |
Calculated formula | C18 B2 Cl6 F10 Fe N6 O6 |
Title of publication | Molecular design of cage iron(ii) and cobalt(ii,iii) complexes with a second fluorine-enriched superhydrophobic shell. |
Authors of publication | Belov, Alexander S.; Zelinskii, Genrikh E.; Varzatskii, Oleg A.; Belaya, Irina G.; Vologzhanina, Anna V.; Dolganov, Alexander V.; Novikov, Valentin V.; Voloshin, Yan Z. |
Journal of publication | Dalton transactions (Cambridge, England : 2003) |
Year of publication | 2015 |
Journal volume | 44 |
Journal issue | 8 |
Pages of publication | 3773 - 3784 |
a | 25.812 ± 0.003 Å |
b | 8.0367 ± 0.0007 Å |
c | 16.0496 ± 0.0015 Å |
α | 90° |
β | 127.284 ± 0.002° |
γ | 90° |
Cell volume | 2649 ± 0.5 Å3 |
Cell temperature | 100 K |
Ambient diffraction temperature | 100 K |
Number of distinct elements | 7 |
Space group number | 15 |
Hermann-Mauguin space group symbol | C 1 2/c 1 |
Hall space group symbol | -C 2yc |
Residual factor for all reflections | 0.03 |
Residual factor for significantly intense reflections | 0.0261 |
Weighted residual factors for significantly intense reflections | 0.0717 |
Weighted residual factors for all reflections included in the refinement | 0.0757 |
Goodness-of-fit parameter for all reflections included in the refinement | 1.059 |
Diffraction radiation wavelength | 0.71073 Å |
Diffraction radiation type | MoKα |