Information card for entry 7033754
Formula | C60 B2 Co F53 N6 O6 S6 |
Calculated formula | C60 B2 Co F53 N6 O6 S6 |
Title of publication | Molecular design of cage iron(ii) and cobalt(ii,iii) complexes with a second fluorine-enriched superhydrophobic shell. |
Authors of publication | Belov, Alexander S.; Zelinskii, Genrikh E.; Varzatskii, Oleg A.; Belaya, Irina G.; Vologzhanina, Anna V.; Dolganov, Alexander V.; Novikov, Valentin V.; Voloshin, Yan Z. |
Journal of publication | Dalton transactions (Cambridge, England : 2003) |
Year of publication | 2015 |
Journal volume | 44 |
Journal issue | 8 |
Pages of publication | 3773 - 3784 |
a | 34.529 ± 0.004 Å |
b | 8.1068 ± 0.0011 Å |
c | 28.045 ± 0.004 Å |
α | 90° |
β | 119.062 ± 0.003° |
γ | 90° |
Cell volume | 6861.9 ± 1.6 Å3 |
Cell temperature | 100 K |
Ambient diffraction temperature | 100 K |
Number of distinct elements | 7 |
Space group number | 15 |
Hermann-Mauguin space group symbol | C 1 2/c 1 |
Hall space group symbol | -C 2yc |
Residual factor for all reflections | 0.0605 |
Residual factor for significantly intense reflections | 0.0481 |
Weighted residual factors for significantly intense reflections | 0.1203 |
Weighted residual factors for all reflections included in the refinement | 0.1295 |
Goodness-of-fit parameter for all reflections included in the refinement | 1.028 |
Diffraction radiation wavelength | 0.71073 Å |
Diffraction radiation type | MoKα |