Information card for entry 7033753
Formula | C60 B2 F52 Fe N6 O6 S6 |
Calculated formula | C60 B2 F52 Fe N6 O6 S6 |
Title of publication | Molecular design of cage iron(ii) and cobalt(ii,iii) complexes with a second fluorine-enriched superhydrophobic shell. |
Authors of publication | Belov, Alexander S.; Zelinskii, Genrikh E.; Varzatskii, Oleg A.; Belaya, Irina G.; Vologzhanina, Anna V.; Dolganov, Alexander V.; Novikov, Valentin V.; Voloshin, Yan Z. |
Journal of publication | Dalton transactions (Cambridge, England : 2003) |
Year of publication | 2015 |
Journal volume | 44 |
Journal issue | 8 |
Pages of publication | 3773 - 3784 |
a | 34.299 ± 0.005 Å |
b | 8.1151 ± 0.0012 Å |
c | 27.97 ± 0.004 Å |
α | 90° |
β | 119.218 ± 0.003° |
γ | 90° |
Cell volume | 6794.6 ± 1.7 Å3 |
Cell temperature | 100 K |
Ambient diffraction temperature | 100 K |
Number of distinct elements | 7 |
Space group number | 15 |
Hermann-Mauguin space group symbol | C 1 2/c 1 |
Hall space group symbol | -C 2yc |
Residual factor for all reflections | 0.1211 |
Residual factor for significantly intense reflections | 0.0794 |
Weighted residual factors for significantly intense reflections | 0.1767 |
Weighted residual factors for all reflections included in the refinement | 0.2021 |
Goodness-of-fit parameter for all reflections included in the refinement | 1.059 |
Diffraction radiation wavelength | 0.71073 Å |
Diffraction radiation type | MoKα |