Information card for entry 7033795
Formula | C18 H39 Cu N4 Si3 |
Calculated formula | C18 H39 Cu N4 Si3 |
SMILES | [Cu]([Si]([Si](C)(C)C)([Si](C)(C)C)CC)(=C1N(C=CN1C)C)=C1N(C=CN1C)C |
Title of publication | Synthesis, structural characterization and thermal properties of copper and silver silyl complexes. |
Authors of publication | Sgro, Michael J.; Piers, Warren E.; Romero, Patricio E. |
Journal of publication | Dalton transactions (Cambridge, England : 2003) |
Year of publication | 2015 |
Journal volume | 44 |
Journal issue | 8 |
Pages of publication | 3817 - 3828 |
a | 12.921 ± 0.0005 Å |
b | 14.106 ± 0.0005 Å |
c | 14.567 ± 0.0004 Å |
α | 90° |
β | 92.34 ± 0.002° |
γ | 90° |
Cell volume | 2652.82 ± 0.16 Å3 |
Cell temperature | 173 ± 2 K |
Ambient diffraction temperature | 173 ± 2 K |
Number of distinct elements | 5 |
Space group number | 14 |
Hermann-Mauguin space group symbol | P 1 21/c 1 |
Hall space group symbol | -P 2ybc |
Residual factor for all reflections | 0.1061 |
Residual factor for significantly intense reflections | 0.0648 |
Weighted residual factors for significantly intense reflections | 0.1305 |
Weighted residual factors for all reflections included in the refinement | 0.1504 |
Goodness-of-fit parameter for all reflections included in the refinement | 1.086 |
Diffraction radiation wavelength | 0.71073 Å |
Diffraction radiation type | MoKα |