Information card for entry 7033796
Formula | C19 H43 Cu N2 Si3 |
Calculated formula | C19 H43 Cu N2 Si3 |
SMILES | [Cu]([Si]([Si](C)(C)C)([Si](C)(C)C)CC)=C1N(C=CN1C(C)(C)C)C(C)(C)C |
Title of publication | Synthesis, structural characterization and thermal properties of copper and silver silyl complexes. |
Authors of publication | Sgro, Michael J.; Piers, Warren E.; Romero, Patricio E. |
Journal of publication | Dalton transactions (Cambridge, England : 2003) |
Year of publication | 2015 |
Journal volume | 44 |
Journal issue | 8 |
Pages of publication | 3817 - 3828 |
a | 10.7614 ± 0.0005 Å |
b | 11.7907 ± 0.0005 Å |
c | 11.9641 ± 0.0005 Å |
α | 73.042 ± 0.002° |
β | 75.264 ± 0.002° |
γ | 69.343 ± 0.002° |
Cell volume | 1339.1 ± 0.1 Å3 |
Cell temperature | 173 ± 2 K |
Ambient diffraction temperature | 173 ± 2 K |
Number of distinct elements | 5 |
Space group number | 2 |
Hermann-Mauguin space group symbol | P -1 |
Hall space group symbol | -P 1 |
Residual factor for all reflections | 0.0346 |
Residual factor for significantly intense reflections | 0.0334 |
Weighted residual factors for significantly intense reflections | 0.0907 |
Weighted residual factors for all reflections included in the refinement | 0.0922 |
Goodness-of-fit parameter for all reflections included in the refinement | 1.062 |
Diffraction radiation wavelength | 1.54178 Å |
Diffraction radiation type | CuKα |