Information card for entry 7033801
Formula | C28 H62 Cu2 N2 Si8 |
Calculated formula | C28 H62 Cu2 N2 Si8 |
SMILES | [Cu]12([Cu]([Si]1([Si](C)(C)C)([Si](C)(C)C)[Si](C)(C)C)[Si]([Si](C)(C)C)([Si](C)(C)C)[Si](C)(C)C)[n]1c(cccc1)c1[n]2cccc1 |
Title of publication | Synthesis, structural characterization and thermal properties of copper and silver silyl complexes. |
Authors of publication | Sgro, Michael J.; Piers, Warren E.; Romero, Patricio E. |
Journal of publication | Dalton transactions (Cambridge, England : 2003) |
Year of publication | 2015 |
Journal volume | 44 |
Journal issue | 8 |
Pages of publication | 3817 - 3828 |
a | 19.6672 ± 0.0008 Å |
b | 18.8226 ± 0.0006 Å |
c | 23.8417 ± 0.0009 Å |
α | 90° |
β | 90° |
γ | 90° |
Cell volume | 8825.9 ± 0.6 Å3 |
Cell temperature | 173 ± 2 K |
Ambient diffraction temperature | 173 ± 2 K |
Number of distinct elements | 5 |
Space group number | 61 |
Hermann-Mauguin space group symbol | P b c a |
Hall space group symbol | -P 2ac 2ab |
Residual factor for all reflections | 0.045 |
Residual factor for significantly intense reflections | 0.0346 |
Weighted residual factors for significantly intense reflections | 0.0902 |
Weighted residual factors for all reflections included in the refinement | 0.0978 |
Goodness-of-fit parameter for all reflections included in the refinement | 1.021 |
Diffraction radiation wavelength | 1.54178 Å |
Diffraction radiation type | CuKα |