Information card for entry 7033807
Formula | C8 H7 Cd N5 S3 |
Calculated formula | C8 H5 Cd N5 S3 |
Title of publication | New 1-D and 3-D thiocyanatocadmates modified by various amine molecules and Cl(-)/CH3COO(-) ions: synthesis, structural characterization, thermal behavior and photoluminescence properties. |
Authors of publication | Guo, Bing; Zhang, Xiao; Wang, Yan-Ning; Huang, Jing-Jing; Yu, Jie-Hui; Xu, Ji-Qing |
Journal of publication | Dalton transactions (Cambridge, England : 2003) |
Year of publication | 2015 |
Journal volume | 44 |
Journal issue | 11 |
Pages of publication | 5095 - 5105 |
a | 10.45 ± 0.002 Å |
b | 9.5557 ± 0.0019 Å |
c | 13.278 ± 0.003 Å |
α | 90° |
β | 90° |
γ | 90° |
Cell volume | 1325.9 ± 0.5 Å3 |
Cell temperature | 293 ± 2 K |
Ambient diffraction temperature | 293 ± 2 K |
Number of distinct elements | 5 |
Space group number | 62 |
Hermann-Mauguin space group symbol | P n m a |
Hall space group symbol | -P 2ac 2n |
Residual factor for all reflections | 0.0376 |
Residual factor for significantly intense reflections | 0.0339 |
Weighted residual factors for significantly intense reflections | 0.0778 |
Weighted residual factors for all reflections included in the refinement | 0.0794 |
Goodness-of-fit parameter for all reflections included in the refinement | 1.112 |
Diffraction radiation wavelength | 0.71073 Å |
Diffraction radiation type | MoKα |