Information card for entry 7033808
Formula | C10 H24 Cd Cl2 N4 S2 |
Calculated formula | C10 H24 Cd Cl2 N4 S2 |
Title of publication | New 1-D and 3-D thiocyanatocadmates modified by various amine molecules and Cl(-)/CH3COO(-) ions: synthesis, structural characterization, thermal behavior and photoluminescence properties. |
Authors of publication | Guo, Bing; Zhang, Xiao; Wang, Yan-Ning; Huang, Jing-Jing; Yu, Jie-Hui; Xu, Ji-Qing |
Journal of publication | Dalton transactions (Cambridge, England : 2003) |
Year of publication | 2015 |
Journal volume | 44 |
Journal issue | 11 |
Pages of publication | 5095 - 5105 |
a | 5.9343 ± 0.0012 Å |
b | 8.7361 ± 0.0017 Å |
c | 10.178 ± 0.002 Å |
α | 107 ± 0.03° |
β | 105.4 ± 0.03° |
γ | 101.23 ± 0.03° |
Cell volume | 464.8 ± 0.2 Å3 |
Cell temperature | 293 ± 2 K |
Ambient diffraction temperature | 293 ± 2 K |
Number of distinct elements | 6 |
Space group number | 2 |
Hermann-Mauguin space group symbol | P -1 |
Hall space group symbol | -P 1 |
Residual factor for all reflections | 0.0331 |
Residual factor for significantly intense reflections | 0.0315 |
Weighted residual factors for significantly intense reflections | 0.0806 |
Weighted residual factors for all reflections included in the refinement | 0.0882 |
Goodness-of-fit parameter for all reflections included in the refinement | 1.187 |
Diffraction radiation wavelength | 0.71073 Å |
Diffraction radiation type | MoKα |