Information card for entry 7033810
Formula | C8 H18 Cd3 Cl6 N4 S2 |
Calculated formula | C8 H18 Cd3 Cl6 N4 S2 |
Title of publication | New 1-D and 3-D thiocyanatocadmates modified by various amine molecules and Cl(-)/CH3COO(-) ions: synthesis, structural characterization, thermal behavior and photoluminescence properties. |
Authors of publication | Guo, Bing; Zhang, Xiao; Wang, Yan-Ning; Huang, Jing-Jing; Yu, Jie-Hui; Xu, Ji-Qing |
Journal of publication | Dalton transactions (Cambridge, England : 2003) |
Year of publication | 2015 |
Journal volume | 44 |
Journal issue | 11 |
Pages of publication | 5095 - 5105 |
a | 15.3979 ± 0.0008 Å |
b | 11.5941 ± 0.0008 Å |
c | 12.5879 ± 0.0008 Å |
α | 90° |
β | 93.862 ± 0.004° |
γ | 90° |
Cell volume | 2242.1 ± 0.2 Å3 |
Cell temperature | 293 ± 2 K |
Ambient diffraction temperature | 293 ± 2 K |
Number of distinct elements | 6 |
Space group number | 15 |
Hermann-Mauguin space group symbol | C 1 2/c 1 |
Hall space group symbol | -C 2yc |
Residual factor for all reflections | 0.044 |
Residual factor for significantly intense reflections | 0.0421 |
Weighted residual factors for significantly intense reflections | 0.1005 |
Weighted residual factors for all reflections included in the refinement | 0.1028 |
Goodness-of-fit parameter for all reflections included in the refinement | 1.187 |
Diffraction radiation wavelength | 0.71073 Å |
Diffraction radiation type | MoKα |