Information card for entry 7033809
Formula | C24 H46 Cd2 N6 O4 S4 |
Calculated formula | C24 H46 Cd2 N6 O4 S4 |
Title of publication | New 1-D and 3-D thiocyanatocadmates modified by various amine molecules and Cl(-)/CH3COO(-) ions: synthesis, structural characterization, thermal behavior and photoluminescence properties. |
Authors of publication | Guo, Bing; Zhang, Xiao; Wang, Yan-Ning; Huang, Jing-Jing; Yu, Jie-Hui; Xu, Ji-Qing |
Journal of publication | Dalton transactions (Cambridge, England : 2003) |
Year of publication | 2015 |
Journal volume | 44 |
Journal issue | 11 |
Pages of publication | 5095 - 5105 |
a | 17.0284 ± 0.0014 Å |
b | 13.261 ± 0.0008 Å |
c | 17.1968 ± 0.0009 Å |
α | 90° |
β | 90° |
γ | 90° |
Cell volume | 3883.3 ± 0.4 Å3 |
Cell temperature | 293 ± 2 K |
Ambient diffraction temperature | 293 ± 2 K |
Number of distinct elements | 6 |
Space group number | 33 |
Hermann-Mauguin space group symbol | P n a 21 |
Hall space group symbol | P 2c -2n |
Residual factor for all reflections | 0.0399 |
Residual factor for significantly intense reflections | 0.0324 |
Weighted residual factors for significantly intense reflections | 0.074 |
Weighted residual factors for all reflections included in the refinement | 0.0805 |
Goodness-of-fit parameter for all reflections included in the refinement | 1.091 |
Diffraction radiation wavelength | 0.71073 Å |
Diffraction radiation type | MoKα |