Information card for entry 7033812
Formula | C136 H149 Fe2 Mn4 N25 O20 |
Calculated formula | C136 H140 Fe2 Mn4 N25 O20 |
Title of publication | Synthesis, crystal structures and magnetic properties of mer-cyanideiron(iii)-based 1D heterobimetallic cyanide-bridged chiral coordination polymers. |
Authors of publication | Zhang, Daopeng; Zhuo, Shuping; Zhang, Hongyan; Wang, Ping; Jiang, Jianzhuang |
Journal of publication | Dalton transactions (Cambridge, England : 2003) |
Year of publication | 2015 |
Journal volume | 44 |
Journal issue | 10 |
Pages of publication | 4655 - 4664 |
a | 19.5092 ± 0.0004 Å |
b | 14.9489 ± 0.0002 Å |
c | 22.5356 ± 0.0004 Å |
α | 90° |
β | 98.24 ± 0.002° |
γ | 90° |
Cell volume | 6504.5 ± 0.2 Å3 |
Cell temperature | 293 ± 2 K |
Ambient diffraction temperature | 293 ± 2 K |
Number of distinct elements | 6 |
Space group number | 4 |
Hermann-Mauguin space group symbol | P 1 21 1 |
Hall space group symbol | P 2yb |
Residual factor for all reflections | 0.0475 |
Residual factor for significantly intense reflections | 0.0399 |
Weighted residual factors for significantly intense reflections | 0.0963 |
Weighted residual factors for all reflections included in the refinement | 0.1005 |
Goodness-of-fit parameter for all reflections included in the refinement | 1.025 |
Diffraction radiation wavelength | 0.71073 Å |
Diffraction radiation type | MoKα |